SWRC-unizh ontology
type: Ontology
comment: Small PAX-local extension of the SWRC ontology used by the original University of Zurich PAX deployment.
imports: ontology

school
type: DatatypeProperty
comment: School or university department associated with a thesis publication.
domain: Publication
range: string

institution
type: DatatypeProperty
comment: Institution associated with a technical report publication.
domain: Publication
range: string